{"text_format":"1","workbook":"xlsx","n_sheets":5,"sheets":["AOV","Data","Resample Data","Simulated Data","Prob A-B"],"not_rendered":{"charts":0,"images":0,"macros":1,"external_links":0,"defined_names":0,"comments":0,"pivot_tables":0},"unopened":[],"bounds":{"document_bytes":16777216,"sheet_cells":100000,"rows_first":2000,"rows_last":500,"rows_between":2000,"halvings":0,"cell_chars":16384,"cell_head_chars":4096},"cells_cut":0,"cells_raw":0,"read":"whole","date_system":"1900"}

{"sheet":"AOV","index":0,"n_rows":60,"n_cols":11,"rows_kept":60,"cut":false,"hidden":false,"merged":[]}
["Creation of Data and AOV - Use this Worksheet to Create Data for Analysis if Desired"]
[null,null,null,null,null,null,null,null,null,"Create samples"]
[null,"Trt 1","Trt 2",null,null,null,null,null,null,"Trt 1","Trt 2"]
[null,4.2865240319135811,3.9134900210847974,null,null,null,null,null,"Mean",4,4.05]
[null,3.9559613302489978,3.7530552759284044,null,null,null,null,null,"Std. Dev.",0.2,0.2]
[null,3.7495577858629034,4.123322399189469,null,null,null,null,null,null,{"$f":"_xlfn.NORM.INV(RAND(),J$4,J$5)","v":3.9540866958787668},{"$f":"_xlfn.NORM.INV(RAND(),K$4,K$5)","v":3.9803372614191592}]
[null,3.907387983045433,4.2409272925835877,null,null,null,null,null,null,{"$f":"_xlfn.NORM.INV(RAND(),J$4,J$5)","v":3.8817528972982704},4.0888020945058869]
[null,4.1956277264062196,3.741747418152392,null,null,null,null,null,null,3.9949679603867256,3.5710355001570453]
[null,4.1473914486022565,3.9650704471667493,null,null,null,null,null,null,4.156848172174346,4.0986724784362298]
[null,3.5760595669305926,3.8195528364067735,null,null,null,null,null,null,3.9376195606700457,4.0525175602249588]
[null,3.85553052793116,3.6532751382229747,null,null,null,null,null,null,3.7208287478125115,4.3526737257881818]
[null,4.081580137436875,3.6706673128512826,null,null,null,null,null,null,4.0384569487142539,3.9233911151999452]
[null,3.8177622088819989,3.8922926261308777,null,null,null,null,null,null,3.8606276512587931,4.3598479905490599]
[null,3.7960524007169378,4.1038865465324479,null,null,null,null,null,null,3.9346506707590736,4.6402419318394168]
[null,4.105836833983818,4.1225704988178267,null,null,null,null,null,null,4.2232676931102331,4.1556701915663403]
[null,3.8614525711628649,3.8713919073496172,null,null,null,null,null,null,4.0257264423497965,3.9141470589229925]
[null,4.1635020005818495,3.7804289463733216,null,null,null,null,null,null,3.7666901804031245,4.0755911062315207]
[null,4.4385317255191765,4.2458699954690564,null,null,null,null,null,null,4.1096959299352624,4.0085934076830263]
[null,4.0623759414860539,3.8480634364297557,null,null,null,null,null,null,3.8418936684931433,4.5490383948339614]
[null,3.3828326206209103,4.2100944986867663,null,null,null,null,null,null,3.7917701451170847,3.793032765879774]
[null,3.8309642028714892,3.9058259739445793,null,null,null,null,null,null,3.8503382044620786,3.9989500729336962]
[null,4.1730670643784977,4.0900568158241271,null,null,null,null,null,null,4.1885621466675138,4.22291037381079]
[null,3.9378416665474685,4.208902559746817,null,null,null,null,null,null,3.7342398561840229,4.1959472671453497]
[null,3.5029586294527295,4.1727608660105426,null,null,null,null,null,null,3.7251759283397989,3.9754101307958059]
[null,3.9632675812956935,3.9916512747927304,null,null,null,null,null,null,3.5810128349926713,4.3057449172986964]
[null,4.1853340016123486,3.9151145062539321,null,null,null,null,null,null,4.3396311251153268,3.7787838585807281]
[null,3.8471759116269264,3.8156475039933326,null,null,null,null,null,null,3.973549166197905,4.1264808245486275]
[null,3.9777353941779947,4.0622629322998174,null,null,null,null,null,null,4.1200526496483416,3.8423994345842623]
[null,4.6403020619758548,4.0838024409458802,null,null,null,null,null,null,3.8929580501333954,4.340543667411934]
[null,3.777217766049088,4.1759275645572469,null,null,null,null,null,null,3.9045243985097864,4.0591272632013879]
[null,3.916434089511962,4.05143730766257,null,null,null,null,null,null,4.269549797447783,4.2061723473279589]
[null,4.0112265351304224,4.1468223230192445,null,null,null,null,null,null,4.1687177773567488,4.1738943172744465]
[null,3.9897405107518011,4.3226300928902379,null,null,null,null,null,null,3.4131779715477215,3.8940514646979816]
[null,4.0715408072816155,4.305666334219695,null,null,null,null,null,null,3.807167704780738,3.9449087198864494]
[null,3.7242712493767987,4.0797879387952447,null,null,null,null,null,null,3.8011092457600109,3.861573389414223]
[null,3.9353690576270419,4.0962837877620988,null,null,null,null,null,null,3.4180527882252476,3.8436579172997662]
[null,4.0633217012012528,3.796325973070247,null,null,null,null,null,null,3.9566198787462969,4.2551477914930969]
[null,3.6789221107870391,4.0017685102027292,null,null,null,null,null,null,4.0525375831734261,3.948136571482701]
[null,3.8078906087433735,4.2309522429746886,null,null,null,null,null,null,4.1943969288328944,4.3541449660926101]
[null,4.1906870264220286,4.1656070126855571,null,null,null,null,null,null,4.1175772446052203,4.0879959155329031]
[null,3.9474219782281761,3.8964441145700421,null,null,null,null,null,null,3.9196512517988191,3.5078365930469486]
[null,3.9428359426241633,4.0201831213338437,null,null,null,null,null,null,4.3893706358358857,4.1046314061600713]
[null,3.4495308325620893,3.9014037701709192,null,null,null,null,null,null,3.8662229863629527,4.2445651732167606]
["Mean",{"$f":"AVERAGE(B4:B43)","v":3.9487255892891873},{"$f":"AVERAGE(C4:C43)","v":4.0098242891275566},{"$f":"AVERAGE(B44:C44)","v":3.9792749392083717},null,null,null,null,null,4.3676498311690803,3.9158671602734501]
["Std dev",{"$f":"STDEV(B4:B43)","v":0.24997479977746562},{"$f":"STDEV(C4:C43)","v":0.17909310483368399},{"$f":"AVERAGE(B45:C45)","v":0.21453395230557482},null,null,null,null,null,3.7851787500704068,4.0541307362807988]
["Count",{"$f":"COUNT(B4:B43)","v":40},{"$f":"COUNT(C4:C43)","v":40},{"$f":"SUM(B46:C46)","v":80}]
[]
[]
["Calculations for AOV - these values are based on the data in Columns B and C of the \"Data\" worksheet"]
[null,{"$f":"SUM(Data!B9:B48)","v":157.94902357156749},{"$f":"SUM(Data!C9:C48)","v":140.17838130336719},{"$f":"SUM(B50:C50)","v":298.12740487493465}]
[null,{"$f":"SUMSQ(Data!B9:B48)","v":626.13435980071711},{"$f":"SUMSQ(Data!C9:C48)","v":562.58019334345545},{"$f":"SUM(B51:C51)","v":1188.7145531441724}]
[null,{"$f":"B50^2","v":24947.894047211583},{"$f":"C50^2","v":19649.978584832203},44597.872632043785]
[null,{"$f":"B52/Data!B52","v":623.69735118028962},{"$f":"C52/Data!C52","v":561.4279595666344},1185.125310746924]
[]
["CF",{"$f":"D50^2/Data!E52","v":1185.0659938328429}]
["Total",{"$f":"D51-B55","v":3.6485593113295636},null,null,null,{"$f":"Data!E52-1","v":74}]
["Trt",{"$f":"D53-B55","v":5.9316914081136929E-2},null,null,null,{"$f":"B59-1","v":1},{"$f":"B57/F57","v":5.9316914081136929E-2},{"$f":"G57/G58","v":1.2064202549380756},{"$f":"FDIST(H57,F57,F58)","v":0.27565177656162043},null,{"$f":"_xlfn.T.TEST(B4:B18,C4:C18,1,2)","v":0.19249397622480013}]
["Error",{"$f":"B56-B57","v":3.5892423972484266},{"$f":"B58/C59","v":4.9167704071896252E-2},{"$f":"SQRT(C58)","v":0.2217379175330558},null,{"$f":"F56-F57","v":73},{"$f":"B58/F58","v":4.9167704071896252E-2}]
[null,{"$f":"COUNT(Data!B49:C49)","v":2},{"$f":"Data!E52-AOV!B59","v":73}]
[null,null,null,null,null,null,{"$f":"SQRT(G58)","v":0.2217379175330558},"s2 pooled"]

{"sheet":"Data","index":1,"n_rows":52,"n_cols":7,"rows_kept":52,"cut":false,"hidden":false,"merged":[]}
["Resampling t-test"]
[]
[]
[]
[]
[]
[null,"Treatment"]
["Observation","A","B"]
[1,4.2865240319135811,3.9134900210847974]
[2,3.9559613302489978,3.7530552759284044]
[3,3.7495577858629034,4.123322399189469]
[4,3.907387983045433,4.2409272925835877,null,null,"Probability Values for Deviations Test"]
[5,4.1956277264062196,3.741747418152392]
[6,4.1473914486022565,3.9650704471667493,null,null,"Empirical P-value",0.13400000000000001]
[7,3.5760595669305926,3.8195528364067735]
[8,3.85553052793116,3.6532751382229747]
[9,4.081580137436875,3.6706673128512826,null,null,"Probability Differences Among Means Based on AOV and t-test"]
[10,3.8177622088819989,3.8922926261308777]
[11,3.7960524007169378,4.1038865465324479,null,null,"AOV F-test",{"$f":"IF(AOV!I57<0.001,0.001,AOV!I57)","v":0.27565177656162043}]
[12,4.105836833983818,4.1225704988178267,null,null,"t-test (one tail)",{"$f":"IF(_xlfn.T.TEST(B9:B48,C9:C48,1,2)<0.001,0.001,(_xlfn.T.TEST(B9:B48,C9:C48,1,2)))","v":0.13782588828119782}]
[13,3.8614525711628649,3.8713919073496172]
[14,4.1635020005818495,3.7804289463733216]
[15,4.4385317255191765,4.2458699954690564]
[16,4.0623759414860539,3.8480634364297557]
[17,3.3828326206209103,4.2100944986867663]
[18,3.8309642028714892,3.9058259739445793]
[19,4.1730670643784977,4.0900568158241271]
[20,3.9378416665474685,4.208902559746817]
[21,3.5029586294527295,4.1727608660105426]
[22,3.9632675812956935,3.9916512747927304]
[23,4.1853340016123486,3.9151145062539321]
[24,3.8471759116269264,3.8156475039933326]
[25,3.9777353941779947,4.0622629322998174]
[26,4.6403020619758548,4.0838024409458802]
[27,3.777217766049088,4.1759275645572469]
[28,3.916434089511962,4.05143730766257]
[29,4.0112265351304224,4.1468223230192445]
[30,3.9897405107518011,4.3226300928902379]
[31,4.0715408072816155,4.305666334219695]
[32,3.7242712493767987,4.0797879387952447]
[33,3.9353690576270419,4.0962837877620988]
[34,4.0633217012012528,3.796325973070247]
[35,3.6789221107870391,4.0017685102027292]
[36,3.8078906087433735]
[37,4.1906870264220286]
[38,3.9474219782281761]
[39,3.9428359426241633]
[40,3.4495308325620893]
["Means",{"$f":"AVERAGE(B9:B48)","v":3.9487255892891873},{"$f":"AVERAGE(C9:C48)","v":4.0050966086676336}]
["Overall Mean",{"$f":"AVERAGE(B49:C49)","v":3.9769110989784107}]
[null,{"$f":"B49-C49","v":-5.6371019378446352E-2}]
[null,{"$f":"COUNT(B9:B48)","v":40},{"$f":"COUNT(C9:C48)","v":35},null,{"$f":"COUNT(B9:C48)","v":75}]

{"sheet":"Resample Data","index":2,"n_rows":80,"n_cols":4,"rows_kept":80,"cut":false,"hidden":false,"merged":[]}
[1,4.2865240319135811,null,{"$f":"Data!E52","v":75}]
[2,3.9559613302489978]
[3,3.7495577858629034]
[4,3.907387983045433]
[5,4.1956277264062196]
[6,4.1473914486022565]
[7,3.5760595669305926]
[8,3.85553052793116]
[9,4.081580137436875]
[10,3.8177622088819989]
[11,3.7960524007169378]
[12,4.105836833983818]
[13,3.8614525711628649]
[14,4.1635020005818495]
[15,4.4385317255191765]
[16,4.0623759414860539]
[17,3.3828326206209103]
[18,3.8309642028714892]
[19,4.1730670643784977]
[20,3.9378416665474685]
[21,3.5029586294527295]
[22,3.9632675812956935]
[23,4.1853340016123486]
[24,3.8471759116269264]
[25,3.9777353941779947]
[26,4.6403020619758548]
[27,3.777217766049088]
[28,3.916434089511962]
[29,4.0112265351304224]
[30,3.9897405107518011]
[31,4.0715408072816155]
[32,3.7242712493767987]
[33,3.9353690576270419]
[34,4.0633217012012528]
[35,3.6789221107870391]
[36,3.8078906087433735]
[37,4.1906870264220286]
[38,3.9474219782281761]
[39,3.9428359426241633]
[40,3.4495308325620893]
[41,3.9134900210847974]
[42,3.7530552759284044]
[43,4.123322399189469]
[44,4.2409272925835877]
[45,3.741747418152392]
[46,3.9650704471667493]
[47,3.8195528364067735]
[48,3.6532751382229747]
[49,3.6706673128512826]
[50,3.8922926261308777]
[51,4.1038865465324479]
[52,4.1225704988178267]
[53,3.8713919073496172]
[54,3.7804289463733216]
[55,4.2458699954690564]
[56,3.8480634364297557]
[57,4.2100944986867663]
[58,3.9058259739445793]
[59,4.0900568158241271]
[60,4.208902559746817]
[61,4.1727608660105426]
[62,3.9916512747927304]
[63,3.9151145062539321]
[64,3.8156475039933326]
[65,4.0622629322998174]
[66,4.0838024409458802]
[67,4.1759275645572469]
[68,4.05143730766257]
[69,4.1468223230192445]
[70,4.3226300928902379]
[71,4.305666334219695]
[72,4.0797879387952447]
[73,4.0962837877620988]
[74,3.796325973070247]
[75,4.0017685102027292]
[76]
[77]
[78]
[79]
[80]
{"$rows_left_out":1}
{"sheet":"Simulated Data","index":3,"n_rows":45,"n_cols":7,"rows_kept":45,"cut":false,"hidden":false,"merged":[]}
["Simulated Data"]
[]
[]
[null,"Simulated Treatment Means"]
["Rep","A","B","A-B"]
[1,{"$f":"INDEX('Resample Data'!$B$1:$B$80,INT(RAND()*'Resample Data'!$D$1)+1,INT(RAND()*1)+1)","v":4.1038865465324479},{"$f":"INDEX('Resample Data'!$B$1:$B$80,INT(RAND()*'Resample Data'!$D$1)+1,INT(RAND()*1)+1)","v":3.8195528364067735},{"$f":"B6-C6","v":0.28433371012567443}]
[2,{"$f":"INDEX('Resample Data'!$B$1:$B$80,INT(RAND()*'Resample Data'!$D$1)+1,INT(RAND()*1)+1)","v":4.1759275645572469},{"$f":"INDEX('Resample Data'!$B$1:$B$80,INT(RAND()*'Resample Data'!$D$1)+1,INT(RAND()*1)+1)","v":3.907387983045433},0.2685395815118139]
[3,{"$f":"INDEX('Resample Data'!$B$1:$B$80,INT(RAND()*'Resample Data'!$D$1)+1,INT(RAND()*1)+1)","v":4.2458699954690564},{"$f":"INDEX('Resample Data'!$B$1:$B$80,INT(RAND()*'Resample Data'!$D$1)+1,INT(RAND()*1)+1)","v":4.1468223230192445},9.9047672449811941E-2]
[4,{"$f":"INDEX('Resample Data'!$B$1:$B$80,INT(RAND()*'Resample Data'!$D$1)+1,INT(RAND()*1)+1)","v":4.1956277264062196},{"$f":"INDEX('Resample Data'!$B$1:$B$80,INT(RAND()*'Resample Data'!$D$1)+1,INT(RAND()*1)+1)","v":3.916434089511962},0.27919363689425758]
[5,{"$f":"INDEX('Resample Data'!$B$1:$B$80,INT(RAND()*'Resample Data'!$D$1)+1,INT(RAND()*1)+1)","v":3.9428359426241633},{"$f":"INDEX('Resample Data'!$B$1:$B$80,INT(RAND()*'Resample Data'!$D$1)+1,INT(RAND()*1)+1)","v":4.1956277264062196},-0.25279178378205636]
[6,{"$f":"INDEX('Resample Data'!$B$1:$B$80,INT(RAND()*'Resample Data'!$D$1)+1,INT(RAND()*1)+1)","v":4.2458699954690564},{"$f":"INDEX('Resample Data'!$B$1:$B$80,INT(RAND()*'Resample Data'!$D$1)+1,INT(RAND()*1)+1)","v":3.7242712493767987},0.52159874609225776]
[7,{"$f":"INDEX('Resample Data'!$B$1:$B$80,INT(RAND()*'Resample Data'!$D$1)+1,INT(RAND()*1)+1)","v":4.208902559746817},{"$f":"INDEX('Resample Data'!$B$1:$B$80,INT(RAND()*'Resample Data'!$D$1)+1,INT(RAND()*1)+1)","v":4.2100944986867663},-1.1919389399492886E-3]
[8,{"$f":"INDEX('Resample Data'!$B$1:$B$80,INT(RAND()*'Resample Data'!$D$1)+1,INT(RAND()*1)+1)","v":3.5760595669305926},{"$f":"INDEX('Resample Data'!$B$1:$B$80,INT(RAND()*'Resample Data'!$D$1)+1,INT(RAND()*1)+1)","v":3.8480634364297557},-0.27200386949916311]
[9,{"$f":"INDEX('Resample Data'!$B$1:$B$80,INT(RAND()*'Resample Data'!$D$1)+1,INT(RAND()*1)+1)","v":4.1473914486022565},{"$f":"INDEX('Resample Data'!$B$1:$B$80,INT(RAND()*'Resample Data'!$D$1)+1,INT(RAND()*1)+1)","v":3.8078906087433735},0.33950083985888302]
[10,{"$f":"INDEX('Resample Data'!$B$1:$B$80,INT(RAND()*'Resample Data'!$D$1)+1,INT(RAND()*1)+1)","v":4.1038865465324479},{"$f":"INDEX('Resample Data'!$B$1:$B$80,INT(RAND()*'Resample Data'!$D$1)+1,INT(RAND()*1)+1)","v":3.9559613302489978},0.14792521628345012]
[11,{"$f":"INDEX('Resample Data'!$B$1:$B$80,INT(RAND()*'Resample Data'!$D$1)+1,INT(RAND()*1)+1)","v":3.7242712493767987},{"$f":"INDEX('Resample Data'!$B$1:$B$80,INT(RAND()*'Resample Data'!$D$1)+1,INT(RAND()*1)+1)","v":3.907387983045433},-0.18311673366863435]
[12,{"$f":"INDEX('Resample Data'!$B$1:$B$80,INT(RAND()*'Resample Data'!$D$1)+1,INT(RAND()*1)+1)","v":4.1225704988178267},{"$f":"INDEX('Resample Data'!$B$1:$B$80,INT(RAND()*'Resample Data'!$D$1)+1,INT(RAND()*1)+1)","v":3.8309642028714892},0.29160629594633747]
[13,{"$f":"INDEX('Resample Data'!$B$1:$B$80,INT(RAND()*'Resample Data'!$D$1)+1,INT(RAND()*1)+1)","v":4.2100944986867663},{"$f":"INDEX('Resample Data'!$B$1:$B$80,INT(RAND()*'Resample Data'!$D$1)+1,INT(RAND()*1)+1)","v":3.8471759116269264},0.36291858705983993]
[14,{"$f":"INDEX('Resample Data'!$B$1:$B$80,INT(RAND()*'Resample Data'!$D$1)+1,INT(RAND()*1)+1)","v":3.8177622088819989},{"$f":"INDEX('Resample Data'!$B$1:$B$80,INT(RAND()*'Resample Data'!$D$1)+1,INT(RAND()*1)+1)","v":4.123322399189469},-0.30556019030747006]
[15,{"$f":"INDEX('Resample Data'!$B$1:$B$80,INT(RAND()*'Resample Data'!$D$1)+1,INT(RAND()*1)+1)","v":3.8309642028714892},{"$f":"INDEX('Resample Data'!$B$1:$B$80,INT(RAND()*'Resample Data'!$D$1)+1,INT(RAND()*1)+1)","v":3.9151145062539321},-8.4150303382442893E-2]
[16,{"$f":"INDEX('Resample Data'!$B$1:$B$80,INT(RAND()*'Resample Data'!$D$1)+1,INT(RAND()*1)+1)","v":3.9916512747927304},{"$f":"INDEX('Resample Data'!$B$1:$B$80,INT(RAND()*'Resample Data'!$D$1)+1,INT(RAND()*1)+1)","v":4.1730670643784977},{"$f":"B21-C21","v":-0.18141578958576732}]
[17,{"$f":"INDEX('Resample Data'!$B$1:$B$80,INT(RAND()*'Resample Data'!$D$1)+1,INT(RAND()*1)+1)","v":4.1853340016123486},{"$f":"INDEX('Resample Data'!$B$1:$B$80,INT(RAND()*'Resample Data'!$D$1)+1,INT(RAND()*1)+1)","v":3.9378416665474685},0.24749233506488011]
[18,{"$f":"INDEX('Resample Data'!$B$1:$B$80,INT(RAND()*'Resample Data'!$D$1)+1,INT(RAND()*1)+1)","v":4.1727608660105426},{"$f":"INDEX('Resample Data'!$B$1:$B$80,INT(RAND()*'Resample Data'!$D$1)+1,INT(RAND()*1)+1)","v":4.0838024409458802},8.895842506466245E-2]
[19,{"$f":"INDEX('Resample Data'!$B$1:$B$80,INT(RAND()*'Resample Data'!$D$1)+1,INT(RAND()*1)+1)","v":3.7804289463733216},{"$f":"INDEX('Resample Data'!$B$1:$B$80,INT(RAND()*'Resample Data'!$D$1)+1,INT(RAND()*1)+1)","v":3.9058259739445793},-0.1253970275712577]
[20,{"$f":"INDEX('Resample Data'!$B$1:$B$80,INT(RAND()*'Resample Data'!$D$1)+1,INT(RAND()*1)+1)","v":3.8922926261308777},{"$f":"INDEX('Resample Data'!$B$1:$B$80,INT(RAND()*'Resample Data'!$D$1)+1,INT(RAND()*1)+1)","v":4.1468223230192445},-0.2545296968883668]
[21,{"$f":"INDEX('Resample Data'!$B$1:$B$80,INT(RAND()*'Resample Data'!$D$1)+1,INT(RAND()*1)+1)","v":4.1730670643784977},{"$f":"INDEX('Resample Data'!$B$1:$B$80,INT(RAND()*'Resample Data'!$D$1)+1,INT(RAND()*1)+1)","v":3.8195528364067735},0.35351422797172427]
[22,{"$f":"INDEX('Resample Data'!$B$1:$B$80,INT(RAND()*'Resample Data'!$D$1)+1,INT(RAND()*1)+1)","v":3.9378416665474685},{"$f":"INDEX('Resample Data'!$B$1:$B$80,INT(RAND()*'Resample Data'!$D$1)+1,INT(RAND()*1)+1)","v":3.9916512747927304},-5.3809608245261931E-2]
[23,{"$f":"INDEX('Resample Data'!$B$1:$B$80,INT(RAND()*'Resample Data'!$D$1)+1,INT(RAND()*1)+1)","v":4.1759275645572469},{"$f":"INDEX('Resample Data'!$B$1:$B$80,INT(RAND()*'Resample Data'!$D$1)+1,INT(RAND()*1)+1)","v":3.6532751382229747},0.52265242633427222]
[24,{"$f":"INDEX('Resample Data'!$B$1:$B$80,INT(RAND()*'Resample Data'!$D$1)+1,INT(RAND()*1)+1)","v":4.6403020619758548},{"$f":"INDEX('Resample Data'!$B$1:$B$80,INT(RAND()*'Resample Data'!$D$1)+1,INT(RAND()*1)+1)","v":3.7960524007169378},0.84424966125891698]
[25,{"$f":"INDEX('Resample Data'!$B$1:$B$80,INT(RAND()*'Resample Data'!$D$1)+1,INT(RAND()*1)+1)","v":4.1038865465324479},{"$f":"INDEX('Resample Data'!$B$1:$B$80,INT(RAND()*'Resample Data'!$D$1)+1,INT(RAND()*1)+1)","v":3.8195528364067735},0.28433371012567443]
[26,{"$f":"INDEX('Resample Data'!$B$1:$B$80,INT(RAND()*'Resample Data'!$D$1)+1,INT(RAND()*1)+1)","v":3.9897405107518011},{"$f":"INDEX('Resample Data'!$B$1:$B$80,INT(RAND()*'Resample Data'!$D$1)+1,INT(RAND()*1)+1)","v":3.8156475039933326},0.1740930067584685]
[27,{"$f":"INDEX('Resample Data'!$B$1:$B$80,INT(RAND()*'Resample Data'!$D$1)+1,INT(RAND()*1)+1)","v":4.305666334219695},{"$f":"INDEX('Resample Data'!$B$1:$B$80,INT(RAND()*'Resample Data'!$D$1)+1,INT(RAND()*1)+1)","v":3.9777353941779947},0.32793094004170031]
[28,{"$f":"INDEX('Resample Data'!$B$1:$B$80,INT(RAND()*'Resample Data'!$D$1)+1,INT(RAND()*1)+1)","v":4.0900568158241271},{"$f":"INDEX('Resample Data'!$B$1:$B$80,INT(RAND()*'Resample Data'!$D$1)+1,INT(RAND()*1)+1)","v":4.4385317255191765},-0.34847490969504946]
[29,{"$f":"INDEX('Resample Data'!$B$1:$B$80,INT(RAND()*'Resample Data'!$D$1)+1,INT(RAND()*1)+1)","v":4.0900568158241271},{"$f":"INDEX('Resample Data'!$B$1:$B$80,INT(RAND()*'Resample Data'!$D$1)+1,INT(RAND()*1)+1)","v":3.3828326206209103},0.70722419520321678]
[30,{"$f":"INDEX('Resample Data'!$B$1:$B$80,INT(RAND()*'Resample Data'!$D$1)+1,INT(RAND()*1)+1)","v":4.105836833983818},{"$f":"INDEX('Resample Data'!$B$1:$B$80,INT(RAND()*'Resample Data'!$D$1)+1,INT(RAND()*1)+1)","v":3.7960524007169378},0.30978443326688021]
[31,{"$f":"INDEX('Resample Data'!$B$1:$B$80,INT(RAND()*'Resample Data'!$D$1)+1,INT(RAND()*1)+1)","v":3.8471759116269264},{"$f":"INDEX('Resample Data'!$B$1:$B$80,INT(RAND()*'Resample Data'!$D$1)+1,INT(RAND()*1)+1)","v":4.3226300928902379},-0.47545418126331151]
[32,{"$f":"INDEX('Resample Data'!$B$1:$B$80,INT(RAND()*'Resample Data'!$D$1)+1,INT(RAND()*1)+1)","v":3.9353690576270419},{"$f":"INDEX('Resample Data'!$B$1:$B$80,INT(RAND()*'Resample Data'!$D$1)+1,INT(RAND()*1)+1)","v":3.7530552759284044},0.18231378169863754]
[33,{"$f":"INDEX('Resample Data'!$B$1:$B$80,INT(RAND()*'Resample Data'!$D$1)+1,INT(RAND()*1)+1)","v":4.05143730766257},{"$f":"INDEX('Resample Data'!$B$1:$B$80,INT(RAND()*'Resample Data'!$D$1)+1,INT(RAND()*1)+1)","v":3.8195528364067735},0.23188447125579659]
[34,{"$f":"INDEX('Resample Data'!$B$1:$B$80,INT(RAND()*'Resample Data'!$D$1)+1,INT(RAND()*1)+1)","v":3.85553052793116},{"$f":"INDEX('Resample Data'!$B$1:$B$80,INT(RAND()*'Resample Data'!$D$1)+1,INT(RAND()*1)+1)","v":4.2458699954690564},-0.39033946753789639]
[35,{"$f":"INDEX('Resample Data'!$B$1:$B$80,INT(RAND()*'Resample Data'!$D$1)+1,INT(RAND()*1)+1)","v":4.105836833983818},{"$f":"INDEX('Resample Data'!$B$1:$B$80,INT(RAND()*'Resample Data'!$D$1)+1,INT(RAND()*1)+1)","v":4.1956277264062196},-8.9790892422401569E-2]
[36,{"$f":"INDEX('Resample Data'!$B$1:$B$80,INT(RAND()*'Resample Data'!$D$1)+1,INT(RAND()*1)+1)","v":3.7530552759284044},{"$f":"INDEX('Resample Data'!$B$1:$B$80,INT(RAND()*'Resample Data'!$D$1)+1,INT(RAND()*1)+1)","v":3.9777353941779947},-0.22468011824959033]
[37,{"$f":"INDEX('Resample Data'!$B$1:$B$80,INT(RAND()*'Resample Data'!$D$1)+1,INT(RAND()*1)+1)","v":3.796325973070247},{"$f":"INDEX('Resample Data'!$B$1:$B$80,INT(RAND()*'Resample Data'!$D$1)+1,INT(RAND()*1)+1)","v":3.9353690576270419},-0.13904308455679493]
[38,{"$f":"INDEX('Resample Data'!$B$1:$B$80,INT(RAND()*'Resample Data'!$D$1)+1,INT(RAND()*1)+1)","v":4.1468223230192445},{"$f":"INDEX('Resample Data'!$B$1:$B$80,INT(RAND()*'Resample Data'!$D$1)+1,INT(RAND()*1)+1)","v":4.1727608660105426},-2.5938542991298164E-2]
[39,{"$f":"INDEX('Resample Data'!$B$1:$B$80,INT(RAND()*'Resample Data'!$D$1)+1,INT(RAND()*1)+1)","v":3.7530552759284044},{"$f":"INDEX('Resample Data'!$B$1:$B$80,INT(RAND()*'Resample Data'!$D$1)+1,INT(RAND()*1)+1)","v":3.8195528364067735},-6.6497560478369078E-2]
[40,{"$f":"INDEX('Resample Data'!$B$1:$B$80,INT(RAND()*'Resample Data'!$D$1)+1,INT(RAND()*1)+1)","v":4.2458699954690564},{"$f":"INDEX('Resample Data'!$B$1:$B$80,INT(RAND()*'Resample Data'!$D$1)+1,INT(RAND()*1)+1)","v":3.9378416665474685},0.30802832892158793,3.9721628445474479,4.0051522852146206,{"$f":"E45-F45","v":-3.2989440667172687E-2}]

{"sheet":"Prob A-B","index":4,"n_rows":1003,"n_cols":8,"rows_kept":1003,"cut":false,"hidden":false,"merged":[]}
["Simulated Differences for Treatment A - Treatment B"]
[null,null,null,null,null,null,"Observed A-B",{"$f":"Data!B51","v":-5.6371019378446352E-2}]
["Rep","Differences","Test",null,null,null,null,0.13400000000000001]
[1,-0.16481138826824093,{"$f":"IF(B4>=$H$2,1,0)","v":0},null,null,null,null,{"$f":"IF(H2>B1003,0.001,IF(H3=1,0.001,IF(H2>0,(1-H3),H3)))","v":0.13400000000000001}]
[2,-0.15632083977308397,{"$f":"IF(B5>=$H$2,1,0)","v":0}]
[3,-0.15501353020021025,0]
[4,-0.15079718526081187,0]
[5,-0.14276543151695265,0]
[6,-0.13742387388838395,0]
[7,-0.12738887994804982,0]
[8,-0.12460583984251805,0]
[9,-0.12326945890601104,0]
[10,-0.12078099616121651,0]
[11,-0.1181201547951134,0]
[12,-0.11711194252654122,0]
[13,-0.11639150030794632,0]
[14,-0.1145581603749628,0]
[15,-0.11423994597266152,0]
[16,-0.11333018795808769,0]
[17,-0.11132292952954348,0]
[18,-0.11114156254059493,0]
[19,-0.10995957292047454,0]
[20,-0.10926662858424852,0]
[21,-0.10847737915272626,0]
[22,-0.10623631892951391,0]
[23,-0.10497436079874012,0]
[24,-0.10477276731046947,0]
[25,-0.10364066354538437,0]
[26,-0.10327475163543465,0]
[27,-0.10285046346658611,0]
[28,-0.10164424538793204,0]
[29,-0.10029102232575005,0]
[30,-9.9768361678772788E-2,0]
[31,-9.9759733339116252E-2,0]
[32,-9.9409978400103238E-2,0]
[33,-9.9326601971772455E-2,0]
[34,-9.9090073776020304E-2,0]
[35,-9.6852073162798646E-2,0]
[36,-9.6119954917124772E-2,0]
[37,-9.5657105243949658E-2,0]
[38,-9.5341922405555835E-2,0]
[39,-9.3897296227073213E-2,0]
[40,-9.1057765281386427E-2,0]
[41,-9.08674158251217E-2,0]
[42,-9.060488154431301E-2,0]
[43,-8.9991256210000703E-2,0]
[44,-8.9191126913586771E-2,0]
[45,-8.7173232890060071E-2,0]
[46,-8.7119645957320913E-2,0]
[47,-8.6988338065598914E-2,0]
[48,-8.6318848642876311E-2,0]
[49,-8.5978441087731561E-2,0]
[50,-8.5805838570877313E-2,0]
[51,-8.5653344595187697E-2,0]
[52,-8.4330351694692496E-2,0]
[53,-8.4306400081943345E-2,0]
[54,-8.3793783636175512E-2,0]
[55,-8.3401932580096094E-2,0]
[56,-8.2377544276526216E-2,0]
[57,-8.2066455804185257E-2,0]
[58,-8.1969298552429848E-2,0]
[59,-8.1681432931958398E-2,0]
[60,-8.1513321637234792E-2,0]
[61,-7.9862287880637428E-2,0]
[62,-7.8977776509926656E-2,0]
[63,-7.8871771150013092E-2,0]
[64,-7.8261753496233766E-2,0]
[65,-7.8222796281860241E-2,0]
[66,-7.7356320908556597E-2,{"$f":"IF(B69>=$H$2,1,0)","v":0}]
[67,-7.6810899184670767E-2,0]
[68,-7.6409718569355967E-2,0]
[69,-7.633953148190642E-2,0]
[70,-7.5991331153889341E-2,0]
[71,-7.4504986001440621E-2,0]
[72,-7.4325829423066647E-2,0]
[73,-7.3594674896128698E-2,0]
[74,-7.3188219582910552E-2,0]
[75,-7.2849281487112894E-2,0]
[76,-7.2816541208636565E-2,0]
[77,-7.2457728560127777E-2,0]
{"$rows_left_out":923}